Reaction Details
TargetCarbonic anhydrase 14
LigandBDBM50100320
Substrate/Competitorn/a
Meas. Tech.ChEMBL_646964 (CHEMBL1217105)
Ki 1030±n/a nM
Citation Carta, FTemperini, CInnocenti, AScozzafava, AKaila, KSupuran, CT Polyamines inhibit carbonic anhydrases by anchoring to the zinc-coordinated water molecule. J Med Chem53:5511-22 (2010) 
 
Carbonic anhydrase 14
Name:Carbonic anhydrase 14
Type:Enzyme
Mol. Mass.:37665.67
Organism:Homo sapiens (Human)
Description:Human (cloned) isozyme.
Residue:337
BDBM50100320
NameBDBM50100320
Synonyms:2-Naphthalen-1-yl-1-(4-{[4-(2-piperidin-1-yl-ethylamino)-butylamino]-methyl}-piperidin-1-yl)-ethanone N-(3-(4-(3-aminopropylamino)butylamino)propyl)-2-(naphthalen-1-yl)acetamide | N-{3-[4-(3-Amino-propylamino)-butylamino]-propyl}-2-naphthalen-1-yl-acetamide
TypeSmall organic molecule
Emp. Form.C22H34N4O
Mol. Mass.370.5316
(=O)Cc1cccc2ccccc12