Reaction Details
TargetCarbonic anhydrase 12
LigandBDBM10880
Substrate/Competitorn/a
Meas. Tech.ChEMBL_646962 (CHEMBL1217103)
Ki 5.7±n/a nM
Citation Carta, FTemperini, CInnocenti, AScozzafava, AKaila, KSupuran, CT Polyamines inhibit carbonic anhydrases by anchoring to the zinc-coordinated water molecule. J Med Chem53:5511-22 (2010) 
 
Carbonic anhydrase 12
Name:Carbonic anhydrase 12
Type:Enzyme
Mol. Mass.:39456.00
Organism:Homo sapiens (Human)
Description:Catalytic domain of human cloned isozyme was used in the assay
Residue:354
BDBM10880
NameBDBM10880
Synonyms:AZA AZM acetazolamide Acetazolamide Acetazolamide (AZA) Acetazolamide, 5 Acetazolamide, AZA CHEMBL20 Sulfonamide, 1 US11278534, Example acetazolamide sulfonamide 1
TypeSmall organic molecule
Emp. Form.C4H6N4O3S2
Mol. Mass.222.245
SMILESCC(=O)Nc1nnc(s1)S(N)(=O)=O