Reaction Details
TargetCannabinoid receptor 2
LigandBDBM50169951
Substrate/Competitorn/a
Meas. Tech.ChEMBL_646967 (CHEMBL1217108)
Ki 52±n/a nM
Citation Dixon, DDSethumadhavan, DBenneche, TBanaag, ARTius, MAThakur, GABowman, AWood, JTMakriyannis, A Heteroadamantyl cannabinoids. J Med Chem53:5656-66 (2010) 
 
Cannabinoid receptor 2
Name:Cannabinoid receptor 2
Type:Enzyme Catalytic Domain
Mol. Mass.:38220.43
Organism:MOUSE
Description:P47936
Residue:347
BDBM50169951
NameBDBM50169951
Synonyms:(6aR,10aR)-3-Adamantan-1-yl-6,6,9-trimethyl-6a,7,10,10a-tetrahydro-6H-benzo[c]chromen-1-ol AM-411 | CHEMBL434351
TypeSmall organic molecule
Emp. Form.C26H34O2
Mol. Mass.378.547
SMILESCC1=CC[C@@H]2[C@@H](C1)c1c(O)cc(cc1OC2(C)C)C12CC3CC(CC(C3)C1)C2