Reaction Details
TargetHeat shock protein HSP 90-alpha
LigandBDBM50165272
Substrate/Competitorn/a
Meas. Tech.ChEMBL_647264 (CHEMBL1217470)
IC50 300±n/a nM
Citation Sekiguchi, HMuranaka, KOsada, AIchikawa, SMatsuda, A Efficient synthesis of Hsp90 inhibitor dimers as potential antitumor agents. Bioorg Med Chem18:5732-7 (2010) 
 
Heat shock protein HSP 90-alpha
Name:Heat shock protein HSP 90-alpha
Type:Molecular Chaperone
Mol. Mass.:84623.45
Organism:Homo sapiens (Human)
Description:P07900
Residue:732
BDBM50165272
NameBDBM50165272
Synonyms:8-(6-Bromo-benzo[1,3]dioxol-5-ylsulfanyl)-9-pent-4-ynyl-9H-purin-6-ylamine CHEMBL365159 | US10676476, Example 1
TypeSmall organic molecule
Emp. Form.C17H14BrN5O2S
Mol. Mass.432.294
SMILESNc1ncnc2n(CCCC#C)c(Sc3cc4OCOc4cc3Br)nc12