Reaction Details
TargetHistone-lysine N-methyltransferase EHMT2
LigandBDBM50323809
Substrate/Competitorn/a
Meas. Tech.ChEMBL_647515 (CHEMBL1217455)
IC50 25000±n/a nM
Citation Liu, FChen, XAllali-Hassani, AQuinn, AMWigle, TJWasney, GADong, ASenisterra, GChau, ISiarheyeva, ANorris, JLKireev, DBJadhav, AHerold, JMJanzen, WPArrowsmith, CHFrye, SVBrown, PJSimeonov, AVedadi, MJin, J Protein lysine methyltransferase G9a inhibitors: design, synthesis, and structure activity relationships of 2,4-diamino-7-aminoalkoxy-quinazolines. J Med Chem53:5844-57 (2010) 
 
Histone-lysine N-methyltransferase EHMT2
Name:Histone-lysine N-methyltransferase EHMT2
Type:Enzyme
Mol. Mass.:132339.87
Organism:Homo sapiens (Human)
Description:Q96KQ7
Residue:1210
BDBM50323809
NameBDBM50323809
Synonyms:6-Methoxy-2-(4-methyl-1,4-diazepan-1-yl)-N-(1-methylpiperidin-4-yl)-7-(3-(piperidin-1-yl)propoxy)quinazolin-4-amine | CHEMBL1213957
TypeSmall organic molecule
Emp. Form.C29H47N7O2
Mol. Mass.525.7292
SMILESCOc1cc2c(NC3CCN(C)CC3)nc(nc2cc1OCCCN1CCCCC1)N1CCCN(C)CC1