Reaction Details
TargetHistone-lysine N-methyltransferase EHMT2
LigandBDBM50300032
Substrate/Competitorn/a
Meas. Tech.ChEMBL_647513 (CHEMBL1217453)
IC50 810000±n/a nM
Citation Liu, FChen, XAllali-Hassani, AQuinn, AMWigle, TJWasney, GADong, ASenisterra, GChau, ISiarheyeva, ANorris, JLKireev, DBJadhav, AHerold, JMJanzen, WPArrowsmith, CHFrye, SVBrown, PJSimeonov, AVedadi, MJin, J Protein lysine methyltransferase G9a inhibitors: design, synthesis, and structure activity relationships of 2,4-diamino-7-aminoalkoxy-quinazolines. J Med Chem53:5844-57 (2010) 
 
Histone-lysine N-methyltransferase EHMT2
Name:Histone-lysine N-methyltransferase EHMT2
Type:Enzyme
Mol. Mass.:132339.87
Organism:Homo sapiens (Human)
Description:Q96KQ7
Residue:1210
BDBM50300032
NameBDBM50300032
Synonyms:6,7-Dimethoxy-N-(1-methylpiperidin-4-yl)-2-morpholinoquinazolin-4-amine | CHEMBL571717
TypeSmall organic molecule
Emp. Form.C20H29N5O3
Mol. Mass.387.476
SMILESCOc1cc2nc(nc(NC3CCN(C)CC3)c2cc1OC)N1CCOCC1