Reaction Details
TargetHistone-lysine N-methyltransferase EHMT2
LigandBDBM50323812
Substrate/Competitorn/a
Meas. Tech.ChEMBL_647515 (CHEMBL1217455)
IC50 235000±n/a nM
Citation Liu, FChen, XAllali-Hassani, AQuinn, AMWigle, TJWasney, GADong, ASenisterra, GChau, ISiarheyeva, ANorris, JLKireev, DBJadhav, AHerold, JMJanzen, WPArrowsmith, CHFrye, SVBrown, PJSimeonov, AVedadi, MJin, J Protein lysine methyltransferase G9a inhibitors: design, synthesis, and structure activity relationships of 2,4-diamino-7-aminoalkoxy-quinazolines. J Med Chem53:5844-57 (2010) 
 
Histone-lysine N-methyltransferase EHMT2
Name:Histone-lysine N-methyltransferase EHMT2
Type:Enzyme
Mol. Mass.:132339.87
Organism:Homo sapiens (Human)
Description:Q96KQ7
Residue:1210
BDBM50323812
NameBDBM50323812
Synonyms:7-(5-Aminopentyloxy)-6-methoxy-2-(4-methyl-1,4-diazepan-1-yl)-N-(1-methylpiperidin-4-yl)quinazolin-4-amine | CHEMBL1214015
TypeSmall organic molecule
Emp. Form.C26H43N7O2
Mol. Mass.485.6653
SMILESCOc1cc2c(NC3CCN(C)CC3)nc(nc2cc1OCCCCCN)N1CCCN(C)CC1