Reaction Details
TargetHistone-lysine N-methyltransferase EHMT2
LigandBDBM50300039
Substrate/Competitorn/a
Meas. Tech.ChEMBL_647513 (CHEMBL1217453)
IC50 5800000±n/a nM
Citation Liu, FChen, XAllali-Hassani, AQuinn, AMWigle, TJWasney, GADong, ASenisterra, GChau, ISiarheyeva, ANorris, JLKireev, DBJadhav, AHerold, JMJanzen, WPArrowsmith, CHFrye, SVBrown, PJSimeonov, AVedadi, MJin, J Protein lysine methyltransferase G9a inhibitors: design, synthesis, and structure activity relationships of 2,4-diamino-7-aminoalkoxy-quinazolines. J Med Chem53:5844-57 (2010) 
 
Histone-lysine N-methyltransferase EHMT2
Name:Histone-lysine N-methyltransferase EHMT2
Type:Enzyme
Mol. Mass.:132339.87
Organism:Homo sapiens (Human)
Description:Q96KQ7
Residue:1210
BDBM50300039
NameBDBM50300039
Synonyms:CHEMBL570799 N-isopropyl-6,7-dimethoxy-2-(4-methyl-1,4-diazepan-1-yl)quinazolin-4-amine
TypeSmall organic molecule
Emp. Form.C19H29N5O2
Mol. Mass.359.4659
SMILESCOc1cc2nc(nc(NC(C)C)c2cc1OC)N1CCCN(C)CC1