Reaction Details
TargetHistone-lysine N-methyltransferase EHMT2
LigandBDBM50323821
Substrate/Competitorn/a
Meas. Tech.ChEMBL_647513 (CHEMBL1217453)
IC50>10000000±n/a nM
Citation Liu, FChen, XAllali-Hassani, AQuinn, AMWigle, TJWasney, GADong, ASenisterra, GChau, ISiarheyeva, ANorris, JLKireev, DBJadhav, AHerold, JMJanzen, WPArrowsmith, CHFrye, SVBrown, PJSimeonov, AVedadi, MJin, J Protein lysine methyltransferase G9a inhibitors: design, synthesis, and structure activity relationships of 2,4-diamino-7-aminoalkoxy-quinazolines. J Med Chem53:5844-57 (2010) 
 
Histone-lysine N-methyltransferase EHMT2
Name:Histone-lysine N-methyltransferase EHMT2
Type:Enzyme
Mol. Mass.:132339.87
Organism:Homo sapiens (Human)
Description:Q96KQ7
Residue:1210
BDBM50323821
NameBDBM50323821
Synonyms:CHEMBL1214014 | tert-Butyl 4-(6-Methoxy-2-(4-methyl-1,4-diazepan-1-yl)-4-(1-methylpiperidin-4-ylamino)quinazolin-7-yloxy)butylcarbamate
TypeSmall organic molecule
Emp. Form.C30H49N7O4
Mol. Mass.571.7546
SMILESCOc1cc2c(NC3CCN(C)CC3)nc(nc2cc1OCCCCNC(=O)OC(C)(C)C)N1CCCN(C)CC1