Reaction Details
TargetSubstance-P receptor
LigandBDBM50264406
Substrate/Competitorn/a
Meas. Tech.ChEMBL_647569 (CHEMBL1217616)
Ki 0.006500±n/a nM
Citation Yamamoto, TNair, PJacobsen, NEKulkarni, VDavis, PMa, SWNavratilova, EYamamura, HIVanderah, TWPorreca, FLai, JHruby, VJ Biological and conformational evaluation of bifunctional compounds for opioid receptor agonists and neurokinin 1 receptor antagonists possessing two penicillamines. J Med Chem53:5491-501 (2010) 
 
Substance-P receptor
Name:Substance-P receptor
Type:G Protein-Coupled Receptor (GPCR)
Mol. Mass.:46254.43
Organism:Homo sapiens (Human)
Description:P25103
Residue:407
BDBM50264406
NameBDBM50264406
Synonyms:(S)-1-((2S,5S,11R,14S)-14-amino-5-benzyl-15-(4-hydroxyphenyl)-11-methyl-2-(2-(methylthio)ethyl)-4,7,10,13-tetraoxo-3,6,9,12-tetraazapentadecane)-N-((S)-1-((S)-1-(3,5-bis(trifluoromethyl)benzylamino)-3-(1H-indol-3-yl)-1-oxopropan-2-ylamino)-4-methyl-1-oxopentan-2-yl)pyrrolidine-2-carboxamide H-Tyr-D-Ala-Gly-Phe-Met-Pro-Leu-Trp-NH-[3',5'-(CF3)2Bzl] | Tyr-D-Ala-Gly-Phe-Met-Pro-Leu-Trp-NH-3,5-Bzl(CF 3) 2
TypeSmall organic molecule
Emp. Form.C59H70F6N10O9S
Mol. Mass.1209.304
SMILESCSCC[C@H](NC(=O)[C@H](Cc1ccccc1)NC(=O)CNC(=O)[C@@H](C)NC(=O)[C@@H](N)Cc1ccc(O)cc1)C(=O)N1CCC[C@H]1C(=O)N[C@@H](CC(C)C)C(=O)N[C@@H](Cc1c[nH]c2ccccc12)C(=O)NCc1cc(cc(c1)C(F)(F)F)C(F)(F)F