Reaction Details
TargetMu-type opioid receptor
LigandBDBM21014
Substrate/Competitorn/a
Meas. Tech.ChEMBL_647570 (CHEMBL1217617)
Ki 1.4±n/a nM
Citation Yamamoto, TNair, PJacobsen, NEKulkarni, VDavis, PMa, SWNavratilova, EYamamura, HIVanderah, TWPorreca, FLai, JHruby, VJ Biological and conformational evaluation of bifunctional compounds for opioid receptor agonists and neurokinin 1 receptor antagonists possessing two penicillamines. J Med Chem53:5491-501 (2010) 
 
Mu-type opioid receptor
Name:Mu-type opioid receptor
Type:G Protein-Coupled Receptor (GPCR)
Mol. Mass.:44503.11
Organism:Rattus norvegicus (rat)
Description:Competition binding assays were carried out using membrane preparations from transfected HN9.10 cells that constitutively expressed the mu opioid receptor.
Residue:398
BDBM21014
NameBDBM21014
Synonyms:(2S)-2-amino-N-[(1R)-1-[({[(1S)-1-{N'-[(2S)-2-{2-[(2R)-2-[(2S)-2-amino-3-(4-hydroxyphenyl)propanamido]propanamido]acetamido}-3-phenylpropanoyl]hydrazinecarbonyl}-2-phenylethyl]carbamoyl}methyl)carbamoyl]ethyl]-3-(4-hydroxyphenyl)propanamide Biphalin bis(Tyr-Ala-Gly-PheNH2)hydrazide | enkephalin dimer
TypeAnalgesics
Emp. Form.C46H56N10O10
Mol. Mass.908.9978
SMILESC[C@@H](NC(=O)[C@@H](N)Cc1ccc(O)cc1)C(=O)NCC(=O)N[C@@H](Cc1ccccc1)C(=O)NNC(=O)[C@H](Cc1ccccc1)NC(=O)CNC(=O)[C@@H](C)NC(=O)[C@@H](N)Cc1ccc(O)cc1