Reaction Details
TargetEstrogen receptor
LigandBDBM50323912
Substrate/Competitorn/a
Meas. Tech.ChEMBL_647642 (CHEMBL1219993)
Ki 13.66±n/a nM
Citation Rivera-Guevara, CPérez-Alvarez, VGarcía-Becerra, ROrdaz-Rosado, DMorales-Ríos, MSHernández-Gallegos, ECooney, AJBravo-Gómez, MELarrea, FCamacho, J Genomic action of permanently charged tamoxifen derivatives via estrogen receptor-alpha. Bioorg Med Chem18:5593-601 (2010) 
 
Estrogen receptor
Name:Estrogen receptor
Type:Protein
Mol. Mass.:66230.44
Organism:Homo sapiens (Human)
Description:P03372
Residue:595
BDBM50323912
NameBDBM50323912
Synonyms:CHEMBL1213784 | Tamoxifen ethyl bromide
TypeSmall organic molecule
Emp. Form.C28H34NO
Mol. Mass.400.5751
SMILESCC\C(=C(/c1ccccc1)c1ccc(OCC[N+](C)(C)CC)cc1)c1ccccc1