Reaction Details
TargetTyrosine-protein kinase ABL1
LigandBDBM50323917
Substrate/Competitorn/a
Meas. Tech.ChEMBL_647651 (CHEMBL1220002)
IC50 12930±n/a nM
Citation Dietrich, JHulme, CHurley, LH The design, synthesis, and evaluation of 8 hybrid DFG-out allosteric kinase inhibitors: a structural analysis of the binding interactions of Gleevec, Nexavar, and BIRB-796. Bioorg Med Chem18:5738-48 (2010) 
 
Tyrosine-protein kinase ABL1
Name:Tyrosine-protein kinase ABL1
Type:PROTEIN
Mol. Mass.:122698.35
Organism:Mus musculus
Description:ChEMBL_767349
Residue:1123
BDBM50323917
NameBDBM50323917
Synonyms:1-(4-chloro-3-(trifluoromethyl)phenyl)-3-(4-(2-morpholinoethoxy)naphthalen-1-yl)urea | CHEMBL1213925
TypeSmall organic molecule
Emp. Form.C24H23ClF3N3O3
Mol. Mass.493.906
SMILESFC(F)(F)c1cc(NC(=O)Nc2ccc(OCCN3CCOCC3)c3ccccc23)ccc1Cl