Reaction Details
TargetSerine/threonine-protein kinase B-raf
LigandBDBM50323918
Substrate/Competitorn/a
Meas. Tech.ChEMBL_647650 (CHEMBL1220001)
IC50 413.9±n/a nM
Citation Dietrich, JHulme, CHurley, LH The design, synthesis, and evaluation of 8 hybrid DFG-out allosteric kinase inhibitors: a structural analysis of the binding interactions of Gleevec, Nexavar, and BIRB-796. Bioorg Med Chem18:5738-48 (2010) 
 
Serine/threonine-protein kinase B-raf
Name:Serine/threonine-protein kinase B-raf
Type:Serine/threonine-protein kinase
Mol. Mass.:84446.00
Organism:Homo sapiens (Human)
Description:P15056
Residue:766
BDBM50323918
NameBDBM50323918
Synonyms:1-(3-tert-butyl-1-p-tolyl-1H-pyrazol-5-yl)-3-(4-methyl-3-(4-(pyridin-3-yl)pyrimidin-2-ylamino)phenyl)urea | CHEMBL1213973
TypeSmall organic molecule
Emp. Form.C31H32N8O
Mol. Mass.532.6388
SMILESCc1ccc(cc1)-n1nc(cc1NC(=O)Nc1ccc(C)c(Nc2nccc(n2)-c2cccnc2)c1)C(C)(C)C