Reaction Details
TargetMitogen-activated protein kinase 14
LigandBDBM50323922
Substrate/Competitorn/a
Meas. Tech.ChEMBL_647147 (CHEMBL1217288)
IC50 18.4±n/a nM
Citation Dietrich, JHulme, CHurley, LH The design, synthesis, and evaluation of 8 hybrid DFG-out allosteric kinase inhibitors: a structural analysis of the binding interactions of Gleevec, Nexavar, and BIRB-796. Bioorg Med Chem18:5738-48 (2010) 
 
Mitogen-activated protein kinase 14
Name:Mitogen-activated protein kinase 14
Type:Serine/threonine-protein kinase
Mol. Mass.:41286.76
Organism:Homo sapiens (Human)
Description:Q16539
Residue:360
BDBM50323922
NameBDBM50323922
Synonyms:1-(4-chloro-3-(trifluoromethyl)phenyl)-3-(4-methyl-3-(4-(pyridin-3-yl)pyrimidin-2-ylamino)phenyl)urea | CHEMBL1213924
TypeSmall organic molecule
Emp. Form.C24H18ClF3N6O
Mol. Mass.498.888
SMILESCc1ccc(NC(=O)Nc2ccc(Cl)c(c2)C(F)(F)F)cc1Nc1nccc(n1)-c1cccnc1