Reaction Details
TargetCarbonic anhydrase 1
LigandBDBM10868
Substrate/Competitorn/a
Meas. Tech.ChEMBL_647167 (CHEMBL1217308)
Ki 8600±n/a nM
Citation Kockar, FMaresca, AAydin, MIsik, STurkoglu, SSinan, SArslan, OGüler, OOTuran, YSupuran, CT Mutation of Phe91 to Asn in human carbonic anhydrase I unexpectedly enhanced both catalytic activity and affinity for sulfonamide inhibitors. Bioorg Med Chem18:5498-503 (2010) 
 
Carbonic anhydrase 1
Name:Carbonic anhydrase 1
Type:Enzyme
Mol. Mass.:28873.37
Organism:Homo sapiens (Human)
Description:P00915
Residue:261
BDBM10868
NameBDBM10868
Synonyms:1,3,4-Thiadiazole-2-sulfonamide, 6 5-Amino-1,3,4-thiadiazole-2-sulphonamide (1) CHEMBL265674 | aromatic/heteroaromatic sulfonamide 13
TypeSmall organic molecule
Emp. Form.C2H4N4O2S2
Mol. Mass.180.209
SMILESNc1nnc(s1)S(N)(=O)=O