Reaction Details
TargetCarbonic anhydrase 2
LigandBDBM10888
Substrate/Competitorn/a
Meas. Tech.ChEMBL_647169 (CHEMBL1217310)
Ki 35±n/a nM
Citation Kockar, FMaresca, AAydin, MIsik, STurkoglu, SSinan, SArslan, OGüler, OOTuran, YSupuran, CT Mutation of Phe91 to Asn in human carbonic anhydrase I unexpectedly enhanced both catalytic activity and affinity for sulfonamide inhibitors. Bioorg Med Chem18:5498-503 (2010) 
 
Carbonic anhydrase 2
Name:Carbonic anhydrase 2
Type:Enzyme
Mol. Mass.:29250.71
Organism:Homo sapiens (Human)
Description:P00918
Residue:260
BDBM10888
NameBDBM10888
Synonyms:1,2-benzoxazol-3-ylmethanesulfonamide SPR_2 Zonisamide Zonisamide (ZNS) Zonisamide, ZNS
TypeSmall organic molecule
Emp. Form.C8H8N2O3S
Mol. Mass.212.226
SMILESNS(=O)(=O)Cc1noc2ccccc12