Reaction Details
TargetMetabotropic glutamate receptor 5
LigandBDBM50323926
Substrate/Competitorn/a
Meas. Tech.ChEMBL_647203 (CHEMBL1217344)
Ki 21.9±n/a nM
Citation Baumann, CAMu, LWertli, NKrämer, SDHoner, MSchubiger, PAAmetamey, SM Syntheses and pharmacological characterization of novel thiazole derivatives as potential mGluR5 PET ligands. Bioorg Med Chem18:6044-54 (2010) 
 
Metabotropic glutamate receptor 5
Name:Metabotropic glutamate receptor 5
Type:Enzyme
Mol. Mass.:131900.14
Organism:Rattus norvegicus (Rat)
Description:P31424
Residue:1203
BDBM50323926
NameBDBM50323926
Synonyms:(E)-3-((2-Methylthiazol-4-yl)ethynyl)cyclohex-2-enone O-2-(2-fluoroethoxy)ethyl oxime | CHEMBL1214363
TypeSmall organic molecule
Emp. Form.C16H19FN2O2S
Mol. Mass.322.398
SMILESCc1nc(cs1)C#CC1=C\C(CCC1)=N\OCCOCCF