Reaction Details
TargetDelta-type opioid receptor
LigandBDBM50324019
Substrate/Competitorn/a
Meas. Tech.ChEMBL_647233 (CHEMBL1217374)
Ki 0.162±n/a nM
Citation Balboni, GMarzola, ESasaki, YAmbo, AMarczak, EDLazarus, LHSalvadori, S Role of 2',6'-dimethyl-l-tyrosine (Dmt) in some opioid lead compounds. Bioorg Med Chem18:6024-30 (2010) 
 
Delta-type opioid receptor
Name:Delta-type opioid receptor
Type:G Protein-Coupled Receptor (GPCR)
Mol. Mass.:40465.04
Organism:Rattus norvegicus (rat)
Description:Competition binding assays were using CHO-K1 cell membranes expressing the opioid receptor.
Residue:372
BDBM50324019
NameBDBM50324019
Synonyms:(S)-3-((S)-2-((S)-2-amino-3-(2,6-difluoro-4-hydroxyphenyl)propanoyl)-1,2,3,4-tetrahydroisoquinoline-3-carboxamido)-3-(1H-benzo[d]imidazol-2-yl)propanoic acid | CHEMBL1213938
TypeSmall organic molecule
Emp. Form.C29H27F2N5O5
Mol. Mass.563.552
SMILESN[C@@H](Cc1c(F)cc(O)cc1F)C(=O)N1Cc2ccccc2C[C@H]1C(=O)N[C@@H](CC(O)=O)c1nc2ccccc2[nH]1