Reaction Details
TargetDelta-type opioid receptor
LigandBDBM50324023
Substrate/Competitorn/a
Meas. Tech.ChEMBL_647233 (CHEMBL1217374)
Ki 0.16±n/a nM
Citation Balboni, GMarzola, ESasaki, YAmbo, AMarczak, EDLazarus, LHSalvadori, S Role of 2',6'-dimethyl-l-tyrosine (Dmt) in some opioid lead compounds. Bioorg Med Chem18:6024-30 (2010) 
 
Delta-type opioid receptor
Name:Delta-type opioid receptor
Type:G Protein-Coupled Receptor (GPCR)
Mol. Mass.:40465.04
Organism:Rattus norvegicus (rat)
Description:Competition binding assays were using CHO-K1 cell membranes expressing the opioid receptor.
Residue:372
BDBM50324023
NameBDBM50324023
Synonyms:(2S,5S,8R,11S,14S)-2-amino-14-((S)-1-((S)-1-(2-amino-2-oxoethylamino)-3-methyl-1-oxobutan-2-ylamino)-3-methyl-1-oxobutan-2-ylcarbamoyl)-11-benzyl-1-(4-hydroxy-2,6-dimethylphenyl)-5-(4-hydroxybenzyl)-8-methyl-3,6,9,12-tetraoxo-4,7,10,13-tetraazaheptadecan-17-oic acid | CHEMBL1213989
TypeSmall organic molecule
Emp. Form.C49H67N9O12
Mol. Mass.974.1094
SMILESCC(C)[C@H](NC(=O)[C@@H](NC(=O)[C@H](CCC(O)=O)NC(=O)[C@H](Cc1ccccc1)NC(=O)[C@@H](C)NC(=O)[C@H](Cc1ccc(O)cc1)NC(=O)[C@@H](N)Cc1c(C)cc(O)cc1C)C(C)C)C(=O)NCC(N)=O