Reaction Details
TargetAcetylcholinesterase
LigandBDBM50324049
Substrate/Competitorn/a
Meas. Tech.ChEMBL_649485 (CHEMBL1219183)
IC50 3500±n/a nM
Citation Samadi, AMarco-Contelles, JSoriano, EAlvarez-Pérez, MChioua, MRomero, AGonzález-Lafuente, LGandía, LRoda, JMLópez, MGVillarroya, MGarcía, AGRíos, Cde L Multipotent drugs with cholinergic and neuroprotective properties for the treatment of Alzheimer and neuronal vascular diseases. I. Synthesis, biological assessment, and molecular modeling of simple and readily available 2-aminopyridine-, and 2-chloropyridine-3,5-dicarbonitriles. Bioorg Med Chem18:5861-72 (2010) 
 
Acetylcholinesterase
Name:Acetylcholinesterase
Type:Enzyme
Mol. Mass.:71812.79
Organism:Electrophorus electricus (Electric eel)
Description:n/a
Residue:633
BDBM50324049
NameBDBM50324049
Synonyms:2-Amino-6-(pyrrolidin-1'-yl)pyridine-3,5-dicarbonitrile | CHEMBL1214890
TypeSmall organic molecule
Emp. Form.C11H11N5
Mol. Mass.213.2385
SMILESNc1nc(N2CCCC2)c(cc1C#N)C#N