Reaction Details
TargetCarboxylic ester hydrolase
LigandBDBM50324063
Substrate/Competitorn/a
Meas. Tech.ChEMBL_649486 (CHEMBL1219184)
IC50>100000±n/a nM
Citation Samadi, AMarco-Contelles, JSoriano, EAlvarez-Pérez, MChioua, MRomero, AGonzález-Lafuente, LGandía, LRoda, JMLópez, MGVillarroya, MGarcía, AGRíos, Cde L Multipotent drugs with cholinergic and neuroprotective properties for the treatment of Alzheimer and neuronal vascular diseases. I. Synthesis, biological assessment, and molecular modeling of simple and readily available 2-aminopyridine-, and 2-chloropyridine-3,5-dicarbonitriles. Bioorg Med Chem18:5861-72 (2010) 
 
Carboxylic ester hydrolase
Name:Carboxylic ester hydrolase
Type:Protein
Mol. Mass.:68842.83
Organism:Equus caballus (Horse)
Description:Q9N1N9
Residue:602
BDBM50324063
NameBDBM50324063
Synonyms:2-Amino-6-(3-phenylpropoxy)pyridine-3,5-dicarbonitrile | CHEMBL1215035
TypeSmall organic molecule
Emp. Form.C16H14N4O
Mol. Mass.278.3086
SMILESNc1nc(OCCCc2ccccc2)c(cc1C#N)C#N