Reaction Details
TargetCarboxylic ester hydrolase
LigandBDBM50324071
Substrate/Competitorn/a
Meas. Tech.ChEMBL_649486 (CHEMBL1219184)
IC50>100000±n/a nM
Citation Samadi, AMarco-Contelles, JSoriano, EAlvarez-Pérez, MChioua, MRomero, AGonzález-Lafuente, LGandía, LRoda, JMLópez, MGVillarroya, MGarcía, AGRíos, Cde L Multipotent drugs with cholinergic and neuroprotective properties for the treatment of Alzheimer and neuronal vascular diseases. I. Synthesis, biological assessment, and molecular modeling of simple and readily available 2-aminopyridine-, and 2-chloropyridine-3,5-dicarbonitriles. Bioorg Med Chem18:5861-72 (2010) 
 
Carboxylic ester hydrolase
Name:Carboxylic ester hydrolase
Type:Protein
Mol. Mass.:68842.83
Organism:Equus caballus (Horse)
Description:Q9N1N9
Residue:602
BDBM50324071
NameBDBM50324071
Synonyms:2-Chloro-6-(pyrrolidin-1'-yl)-4-phenylpyridine-3,5-dicarbonitrile | CHEMBL1215177
TypeSmall organic molecule
Emp. Form.C17H13ClN4
Mol. Mass.308.765
SMILESClc1nc(N2CCCC2)c(C#N)c(-c2ccccc2)c1C#N