Reaction Details
TargetPolyunsaturated fatty acid 5-lipoxygenase
LigandBDBM50324109
Substrate/Competitorn/a
Meas. Tech.ChEMBL_649691 (CHEMBL1219389)
IC50 4000±n/a nM
Citation Reddy, NPAparoy, PReddy, TCAchari, CSridhar, PRReddanna, P Design, synthesis, and biological evaluation of prenylated chalcones as 5-LOX inhibitors. Bioorg Med Chem18:5807-15 (2010) 
 
Polyunsaturated fatty acid 5-lipoxygenase
Name:Polyunsaturated fatty acid 5-lipoxygenase
Type:Enzyme
Mol. Mass.:77972.74
Organism:Homo sapiens (Human)
Description:Recombinant protein was purified from E. coli lysate. After ammonium sulfate precipitation and subsequent steps, the supernatant (S100) was used for 5-LO activity assay.
Residue:674
BDBM50324109
NameBDBM50324109
Synonyms:3,4,5-Trimethoxy-2',4'-di-O-prenylchalcone | CHEMBL1215120
TypeSmall organic molecule
Emp. Form.C28H34O6
Mol. Mass.466.566
SMILES[#6]-[#8]-c1cc(\[#6]=[#6]\[#6](=O)-c2ccc(-[#8]-[#6]\[#6]=[#6](\[#6])-[#6])cc2-[#8]-[#6]\[#6]=[#6](/[#6])-[#6])cc(-[#8]-[#6])c1-[#8]-[#6]