Reaction Details
TargetHistone deacetylase
LigandBDBM50324110
Substrate/Competitorn/a
Meas. Tech.ChEMBL_649854 (CHEMBL1219552)
IC50 36±n/a nM
Citation Mwakwari, SCGuerrant, WPatil, VKhan, SITekwani, BLGurard-Levin, ZAMrksich, MOyelere, AK Non-peptide macrocyclic histone deacetylase inhibitors derived from tricyclic ketolide skeleton. J Med Chem53:6100-11 (2010) 
 
Histone deacetylase
Name:Histone deacetylase
Synonyms:Histone Deacetylase (pfHDAC-1)
Type:Enzyme
Mol. Mass.:51371.91
Organism:Plasmodium falciparum (isolate 3D7)
Description:Assays were performed using recombinant pfHDAC-1 expressed and purified from S2 insect cells.
Residue:449
BDBM50324110
NameBDBM50324110
Synonyms:CHEMBL1214759
TypeSmall organic molecule
Emp. Form.C47H71N7O11
Mol. Mass.910.1069
SMILESCC[C@H]1OC(=O)[C@H](C)C(=O)[C@H](C)[C@@H](O[C@@H]2O[C@H](C)C[C@@H]([C@H]2O)N(C)Cc2ccc(cc2)-c2cn(CCCCCC(=O)NO)nn2)[C@@](C)(C[C@@H](C)C2=NCCN3[C@H]([C@H]2C)[C@]1(C)OC3=O)OC