Reaction Details
TargetHistone deacetylase 8
LigandBDBM50324112
Substrate/Competitorn/a
Meas. Tech.ChEMBL_649840 (CHEMBL1219538)
IC50 825±n/a nM
Citation Mwakwari, SCGuerrant, WPatil, VKhan, SITekwani, BLGurard-Levin, ZAMrksich, MOyelere, AK Non-peptide macrocyclic histone deacetylase inhibitors derived from tricyclic ketolide skeleton. J Med Chem53:6100-11 (2010) 
 
Histone deacetylase 8
Name:Histone deacetylase 8
Type:Enzyme
Mol. Mass.:41749.60
Organism:Homo sapiens (Human)
Description:Q9BY41
Residue:377
BDBM50324112
NameBDBM50324112
Synonyms:CHEMBL1214763
TypeSmall organic molecule
Emp. Form.C51H79N7O11
Mol. Mass.966.2133
SMILESCC[C@H]1OC(=O)[C@H](C)C(=O)[C@H](C)[C@@H](O[C@@H]2O[C@H](C)C[C@@H]([C@H]2O)N(C)Cc2ccc(cc2)-c2cn(CCCCCCCCCC(=O)NO)nn2)[C@@](C)(C[C@@H](C)C2=NCCN3[C@H]([C@H]2C)[C@]1(C)OC3=O)OC