Reaction Details
TargetAurora kinase B
LigandBDBM50324263
Substrate/Competitorn/a
Meas. Tech.ChEMBL_650024 (CHEMBL1219722)
IC50 1720±n/a nM
Citation Chiang, CCLin, YHLin, SFLai, CLLiu, CWei, WYYang, SCWang, RWTeng, LWChuang, SHChang, JMYuan, TTLee, YSChen, PChi, WKYang, JYHuang, HJLiao, CBHuang, JJ Discovery of pyrrole-indoline-2-ones as Aurora kinase inhibitors with a different inhibition profile. J Med Chem53:5929-41 (2010) 
 
Aurora kinase B
Name:Aurora kinase B
Type:Protein
Mol. Mass.:39327.72
Organism:Homo sapiens (Human)
Description:Q96GD4
Residue:344
BDBM50324263
NameBDBM50324263
Synonyms:(Z)-3-(2-{[5-(N,N-Dimethylsulfamoyl)-2-oxoindolin-3-ylidene]-methyl}-4-oxo-4,5,6,7-tetrahydro-1H-indol-3-yl)propanoic Acid | CHEMBL1215071
TypeSmall organic molecule
Emp. Form.C22H23N3O6S
Mol. Mass.457.5
SMILESCN(C)S(=O)(=O)c1ccc2NC(=O)C(=Cc3[nH]c4CCCC(=O)c4c3CCC(O)=O)c2c1