Reaction Details
TargetAurora kinase B
LigandBDBM50324264
Substrate/Competitorn/a
Meas. Tech.ChEMBL_650024 (CHEMBL1219722)
IC50 441±n/a nM
Citation Chiang, CCLin, YHLin, SFLai, CLLiu, CWei, WYYang, SCWang, RWTeng, LWChuang, SHChang, JMYuan, TTLee, YSChen, PChi, WKYang, JYHuang, HJLiao, CBHuang, JJ Discovery of pyrrole-indoline-2-ones as Aurora kinase inhibitors with a different inhibition profile. J Med Chem53:5929-41 (2010) 
 
Aurora kinase B
Name:Aurora kinase B
Type:Protein
Mol. Mass.:39327.72
Organism:Homo sapiens (Human)
Description:Q96GD4
Residue:344
BDBM50324264
NameBDBM50324264
Synonyms:(Z)-3-(4-Oxo-2-{[2-oxo-5-(pyrrolidin-1-ylsulfonyl)indolin-3-ylidene]methyl}-4,5,6,7-tetrahydro-1H-indol-3-yl)propanoic Acid | CHEMBL1215072
TypeSmall organic molecule
Emp. Form.C24H25N3O6S
Mol. Mass.483.537
SMILESOC(=O)CCc1c(C=C2C(=O)Nc3ccc(cc23)S(=O)(=O)N2CCCC2)[nH]c2CCCC(=O)c12