Reaction Details
TargetReceptor-type tyrosine-protein kinase FLT3
LigandBDBM50324277
Substrate/Competitorn/a
Meas. Tech.ChEMBL_650086 (CHEMBL1219784)
IC50<1000±n/a nM
Citation Chiang, CCLin, YHLin, SFLai, CLLiu, CWei, WYYang, SCWang, RWTeng, LWChuang, SHChang, JMYuan, TTLee, YSChen, PChi, WKYang, JYHuang, HJLiao, CBHuang, JJ Discovery of pyrrole-indoline-2-ones as Aurora kinase inhibitors with a different inhibition profile. J Med Chem53:5929-41 (2010) 
 
Receptor-type tyrosine-protein kinase FLT3
Name:Receptor-type tyrosine-protein kinase FLT3
Type:Enzyme
Mol. Mass.:112888.62
Organism:Homo sapiens (Human)
Description:P36888
Residue:993
BDBM50324277
NameBDBM50324277
Synonyms:(Z)-N-[3-({3-[3-(Dimethylamino)propyl]-4-oxo-4,5,6,7-tetrahydro-1H-indol-2-yl}methylene)-2-oxoindolin-5-yl]benzenesulfonamide | CHEMBL1215346
TypeSmall organic molecule
Emp. Form.C28H30N4O4S
Mol. Mass.518.627
SMILESCN(C)CCCc1c(C=C2C(=O)Nc3ccc(NS(=O)(=O)c4ccccc4)cc23)[nH]c2CCCC(=O)c12