Reaction Details
TargetAurora kinase A
LigandBDBM50324251
Substrate/Competitorn/a
Meas. Tech.ChEMBL_650022 (CHEMBL1219720)
IC50 210±n/a nM
Citation Chiang, CCLin, YHLin, SFLai, CLLiu, CWei, WYYang, SCWang, RWTeng, LWChuang, SHChang, JMYuan, TTLee, YSChen, PChi, WKYang, JYHuang, HJLiao, CBHuang, JJ Discovery of pyrrole-indoline-2-ones as Aurora kinase inhibitors with a different inhibition profile. J Med Chem53:5929-41 (2010) 
 
Aurora kinase A
Name:Aurora kinase A
Type:Serine/threonine-protein kinase
Mol. Mass.:45830.98
Organism:Homo sapiens (Human)
Description:O14965
Residue:403
BDBM50324251
NameBDBM50324251
Synonyms:(Z)-3-{2-[(5-Bromo-2-oxoindolin-3-ylidene)methyl]-4-oxo-4,5,6,7-tetrahydro-1H-indol-3-yl}propanoic Acid | CHEMBL1214854
TypeSmall organic molecule
Emp. Form.C20H17BrN2O4
Mol. Mass.429.264
SMILESOC(=O)CCc1c(C=C2C(=O)Nc3ccc(Br)cc23)[nH]c2CCCC(=O)c12