Reaction Details
TargetAurora kinase A
LigandBDBM50324254
Substrate/Competitorn/a
Meas. Tech.ChEMBL_650022 (CHEMBL1219720)
IC50 560±n/a nM
Citation Chiang, CCLin, YHLin, SFLai, CLLiu, CWei, WYYang, SCWang, RWTeng, LWChuang, SHChang, JMYuan, TTLee, YSChen, PChi, WKYang, JYHuang, HJLiao, CBHuang, JJ Discovery of pyrrole-indoline-2-ones as Aurora kinase inhibitors with a different inhibition profile. J Med Chem53:5929-41 (2010) 
 
Aurora kinase A
Name:Aurora kinase A
Type:Serine/threonine-protein kinase
Mol. Mass.:45830.98
Organism:Homo sapiens (Human)
Description:O14965
Residue:403
BDBM50324254
NameBDBM50324254
Synonyms:(Z)-3-(2-{[5-(3,4-Dimethoxyphenyl)-2-oxoindolin-3-ylidene]-methyl}-4-oxo-4,5,6,7-tetrahydro-1H-indol-3-yl)propanoic Acid | CHEMBL1214925
TypeSmall organic molecule
Emp. Form.C28H26N2O6
Mol. Mass.486.5158
SMILESCOc1ccc(cc1OC)-c1ccc2NC(=O)C(=Cc3[nH]c4CCCC(=O)c4c3CCC(O)=O)c2c1