Reaction Details
TargetAurora kinase A
LigandBDBM50324274
Substrate/Competitorn/a
Meas. Tech.ChEMBL_650022 (CHEMBL1219720)
IC50 117±n/a nM
Citation Chiang, CCLin, YHLin, SFLai, CLLiu, CWei, WYYang, SCWang, RWTeng, LWChuang, SHChang, JMYuan, TTLee, YSChen, PChi, WKYang, JYHuang, HJLiao, CBHuang, JJ Discovery of pyrrole-indoline-2-ones as Aurora kinase inhibitors with a different inhibition profile. J Med Chem53:5929-41 (2010) 
 
Aurora kinase A
Name:Aurora kinase A
Type:Serine/threonine-protein kinase
Mol. Mass.:45830.98
Organism:Homo sapiens (Human)
Description:O14965
Residue:403
BDBM50324274
NameBDBM50324274
Synonyms:(Z)-N-Methyl-3-(4-oxo-2-{[2-oxo-5-(phenylsulfonamido)-indolin-3-ylidene]methyl}-4,5,6,7-tetrahydro-1H-indol-3-yl)-propanamide | CHEMBL1215282
TypeSmall organic molecule
Emp. Form.C27H26N4O5S
Mol. Mass.518.584
SMILESCNC(=O)CCc1c(C=C2C(=O)Nc3ccc(NS(=O)(=O)c4ccccc4)cc23)[nH]c2CCCC(=O)c12