Reaction Details
TargetPlatelet-derived growth factor receptor beta
LigandBDBM50324271
Substrate/Competitorn/a
Meas. Tech.ChEMBL_650087 (CHEMBL1219785)
IC50>1000±n/a nM
Citation Chiang, CCLin, YHLin, SFLai, CLLiu, CWei, WYYang, SCWang, RWTeng, LWChuang, SHChang, JMYuan, TTLee, YSChen, PChi, WKYang, JYHuang, HJLiao, CBHuang, JJ Discovery of pyrrole-indoline-2-ones as Aurora kinase inhibitors with a different inhibition profile. J Med Chem53:5929-41 (2010) 
 
Platelet-derived growth factor receptor beta
Name:Platelet-derived growth factor receptor beta
Type:Enzyme
Mol. Mass.:123922.25
Organism:Homo sapiens (Human)
Description:P09619
Residue:1106
BDBM50324271
NameBDBM50324271
Synonyms:(Z)-Ethyl 3-(4-Oxo-2-{[2-oxo-5-(phenylsulfonamido)indolin-3-ylidene]methyl}-4,5,6,7-tetrahydro-1H-indol-3-yl)propanoate | CHEMBL1215218
TypeSmall organic molecule
Emp. Form.C28H27N3O6S
Mol. Mass.533.595
SMILESCCOC(=O)CCc1c(C=C2C(=O)Nc3ccc(NS(=O)(=O)c4ccccc4)cc23)[nH]c2CCCC(=O)c12