Reaction Details
TargetSerine/threonine-protein kinase D1
LigandBDBM50324348
Substrate/Competitorn/a
Meas. Tech.ChEMBL_650172 (CHEMBL1219870)
IC50<1±n/a nM
Citation Meredith, ELBeattie, KBurgis, RCapparelli, MChapo, JDipietro, LGamber, GEnyedy, IHood, DBHosagrahara, VJewell, CKoch, KALee, WLemon, DDMcKinsey, TAMiranda, KPagratis, NPhan, DPlato, CRao, CRozhitskaya, OSoldermann, NSpringer, Cvan Eis, MVega, RBYan, WZhu, QMonovich, LG Identification of potent and selective amidobipyridyl inhibitors of protein kinase D. J Med Chem53:5422-38 (2010) 
 
Serine/threonine-protein kinase D1
Name:Serine/threonine-protein kinase D1
Type:Serine/threonine-protein kinase
Mol. Mass.:101705.07
Organism:Homo sapiens (Human)
Description:gi_115529463
Residue:912
BDBM50324348
NameBDBM50324348
Synonyms:6-(piperazin-1-yl)-4-(4H-pyrazol-4-yl)-N-(tetrahydro-2H-pyran-4-yl)-2,4'-bipyridin-2'-amine | CHEMBL1215219
TypeSmall organic molecule
Emp. Form.C22H27N7O
Mol. Mass.405.4961
SMILESC1CN(CCN1)c1cc(cc(n1)-c1ccnc(NC2CCOCC2)c1)-c1cn[nH]c1