Reaction Details
TargetPolycystin-2
LigandBDBM50324324
Substrate/Competitorn/a
Meas. Tech.ChEMBL_650175 (CHEMBL1219873)
IC50 1±n/a nM
Citation Meredith, ELBeattie, KBurgis, RCapparelli, MChapo, JDipietro, LGamber, GEnyedy, IHood, DBHosagrahara, VJewell, CKoch, KALee, WLemon, DDMcKinsey, TAMiranda, KPagratis, NPhan, DPlato, CRao, CRozhitskaya, OSoldermann, NSpringer, Cvan Eis, MVega, RBYan, WZhu, QMonovich, LG Identification of potent and selective amidobipyridyl inhibitors of protein kinase D. J Med Chem53:5422-38 (2010) 
 
Polycystin-2
Name:Polycystin-2
Type:PROTEIN
Mol. Mass.:109676.85
Organism:Homo sapiens (Human)
Description:ChEMBL_886731
Residue:968
BDBM50324324
NameBDBM50324324
Synonyms:2'-Phenylamino-6-piperazin-1-yl[2,4']bipyridinyl-4-carboxylic Acid Methyl Amide | CHEMBL1215000
TypeSmall organic molecule
Emp. Form.C21H22N6O
Mol. Mass.374.439
SMILESNC(=O)c1cc(nc(c1)-c1ccnc(Nc2ccccc2)c1)N1CCNCC1