Reaction Details
TargetHematopoietic prostaglandin D synthase
LigandBDBM50324484
Substrate/Competitorn/a
Meas. Tech.ChEMBL_649226 (CHEMBL1218924)
IC50 2100±n/a nM
Citation Christ, ANLabzin, LBourne, GTFukunishi, HWeber, JESweet, MJSmythe, MLFlanagan, JU Development and characterization of new inhibitors of the human and mouse hematopoietic prostaglandin D(2) synthases. J Med Chem53:5536-48 (2010) 
 
Hematopoietic prostaglandin D synthase
Name:Hematopoietic prostaglandin D synthase
Type:Enzyme
Mol. Mass.:23341.07
Organism:Homo sapiens (Human)
Description:The protein was expressed in E. coli strain BL21(DE3) with an N-terminal 6-His tag.
Residue:199
BDBM50324484
NameBDBM50324484
Synonyms:CHEMBL1215298 | N-(1-Amino-3-(1H-indol-3-yl)-1-oxopropan-2-yl)-5-(3-hydroxyphenyl)thiophene-2-carboxamide
TypeSmall organic molecule
Emp. Form.C22H19N3O3S
Mol. Mass.405.47
SMILESNC(=O)C(Cc1c[nH]c2ccccc12)NC(=O)c1ccc(s1)-c1cccc(O)c1