Reaction Details
TargetHematopoietic prostaglandin D synthase
LigandBDBM50324489
Substrate/Competitorn/a
Meas. Tech.ChEMBL_649226 (CHEMBL1218924)
IC50 10800±n/a nM
Citation Christ, ANLabzin, LBourne, GTFukunishi, HWeber, JESweet, MJSmythe, MLFlanagan, JU Development and characterization of new inhibitors of the human and mouse hematopoietic prostaglandin D(2) synthases. J Med Chem53:5536-48 (2010) 
 
Hematopoietic prostaglandin D synthase
Name:Hematopoietic prostaglandin D synthase
Type:Enzyme
Mol. Mass.:23341.07
Organism:Homo sapiens (Human)
Description:The protein was expressed in E. coli strain BL21(DE3) with an N-terminal 6-His tag.
Residue:199
BDBM50324489
NameBDBM50324489
Synonyms:CHEMBL1215162 | N-benzhydryl-2-(3-hydroxyphenyl)thiazole-4-carboxamide
TypeSmall organic molecule
Emp. Form.C23H18N2O2S
Mol. Mass.386.466
SMILESOc1cccc(c1)-c1nc(cs1)C(=O)NC(c1ccccc1)c1ccccc1