Reaction Details
TargetDipeptidyl peptidase 9
LigandBDBM50324506
Substrate/Competitorn/a
Meas. Tech.ChEMBL_649274 (CHEMBL1218972)
Ki 3.5±n/a nM
Citation Meng, WBrigance, RPChao, HJFura, AHarrity, TMarcinkeviciene, JO'Connor, SPTamura, JKXie, DZhang, YKlei, HEKish, KWeigelt, CATurdi, HWang, AZahler, RKirby, MSHamann, LG Discovery of 6-(aminomethyl)-5-(2,4-dichlorophenyl)-7-methylimidazo[1,2-a]pyrimidine-2-carboxamides as potent, selective dipeptidyl peptidase-4 (DPP4) inhibitors. J Med Chem53:5620-8 (2010) 
 
Dipeptidyl peptidase 9
Name:Dipeptidyl peptidase 9
Type:Enzyme
Mol. Mass.:98260.70
Organism:Homo sapiens (Human)
Description:Q86TI2
Residue:863
BDBM50324506
NameBDBM50324506
Synonyms:6-(aminomethyl)-5-(2,4-dichlorophenyl)-N-(furan-2-ylmethyl)-7-methylimidazo[1,2-a]pyrimidine-2-carboxamide | CHEMBL1215300
TypeSmall organic molecule
Emp. Form.C20H17Cl2N5O2
Mol. Mass.430.287
SMILESCc1nc2nc(cn2c(c1CN)-c1ccc(Cl)cc1Cl)C(=O)NCc1ccco1