Reaction Details
TargetDipeptidyl peptidase 8
LigandBDBM50324518
Substrate/Competitorn/a
Meas. Tech.ChEMBL_649273 (CHEMBL1218971)
Ki 2.2±n/a nM
Citation Meng, WBrigance, RPChao, HJFura, AHarrity, TMarcinkeviciene, JO'Connor, SPTamura, JKXie, DZhang, YKlei, HEKish, KWeigelt, CATurdi, HWang, AZahler, RKirby, MSHamann, LG Discovery of 6-(aminomethyl)-5-(2,4-dichlorophenyl)-7-methylimidazo[1,2-a]pyrimidine-2-carboxamides as potent, selective dipeptidyl peptidase-4 (DPP4) inhibitors. J Med Chem53:5620-8 (2010) 
 
Dipeptidyl peptidase 8
Name:Dipeptidyl peptidase 8
Type:Enzyme
Mol. Mass.:103342.62
Organism:Homo sapiens (Human)
Description:Q6V1X1
Residue:898
BDBM50324518
NameBDBM50324518
Synonyms:6-(aminomethyl)-5-(2,4-dichlorophenyl)-7-methyl-N-(tetrahydro-2H-pyran-4-yl)imidazo[1,2-a]pyrimidine-2-carboxamide | CHEMBL1214944
TypeSmall organic molecule
Emp. Form.C20H21Cl2N5O2
Mol. Mass.434.319
SMILESCc1nc2nc(cn2c(c1CN)-c1ccc(Cl)cc1Cl)C(=O)NC1CCOCC1