Reaction Details
TargetDipeptidyl peptidase 9
LigandBDBM50324522
Substrate/Competitorn/a
Meas. Tech.ChEMBL_649274 (CHEMBL1218972)
Ki 1.3±n/a nM
Citation Meng, WBrigance, RPChao, HJFura, AHarrity, TMarcinkeviciene, JO'Connor, SPTamura, JKXie, DZhang, YKlei, HEKish, KWeigelt, CATurdi, HWang, AZahler, RKirby, MSHamann, LG Discovery of 6-(aminomethyl)-5-(2,4-dichlorophenyl)-7-methylimidazo[1,2-a]pyrimidine-2-carboxamides as potent, selective dipeptidyl peptidase-4 (DPP4) inhibitors. J Med Chem53:5620-8 (2010) 
 
Dipeptidyl peptidase 9
Name:Dipeptidyl peptidase 9
Type:Enzyme
Mol. Mass.:98260.70
Organism:Homo sapiens (Human)
Description:Q86TI2
Residue:863
BDBM50324522
NameBDBM50324522
Synonyms:(6-(aminomethyl)-5-(2,4-dichlorophenyl)-7-methylimidazo[1,2-a]pyrimidin-2-yl)((R)-2-(methoxymethyl)pyrrolidin-1-yl)methanone | CHEMBL1215017
TypeSmall organic molecule
Emp. Form.C21H23Cl2N5O2
Mol. Mass.448.346
SMILESCOC[C@H]1CCCN1C(=O)c1cn2c(c(CN)c(C)nc2n1)-c1ccc(Cl)cc1Cl