Reaction Details
TargetLysine-specific demethylase 4A
LigandBDBM50324529
Substrate/Competitorn/a
Meas. Tech.ChEMBL_649377 (CHEMBL1219075)
IC50 2000±n/a nM
Citation Hamada, SSuzuki, TMino, KKoseki, KOehme, FFlamme, IOzasa, HItoh, YOgasawara, DKomaarashi, HKato, ATsumoto, HNakagawa, HHasegawa, MSasaki, RMizukami, TMiyata, N Design, synthesis, enzyme-inhibitory activity, and effect on human cancer cells of a novel series of jumonji domain-containing protein 2 histone demethylase inhibitors. J Med Chem53:5629-38 (2010) 
 
Lysine-specific demethylase 4A
Name:Lysine-specific demethylase 4A
Type:Enzyme
Mol. Mass.:120647.83
Organism:Homo sapiens (Human)
Description:O75164
Residue:1064
BDBM50324529
NameBDBM50324529
Synonyms:3-({9-[Benzyl(methyl)]amino}nonanoyl(hydroxy)amino)propanoicAcid Hydrochloride | CHEMBL1215589
TypeSmall organic molecule
Emp. Form.C20H32N2O4
Mol. Mass.364.4791
SMILESCN(CCCCCCCCC(=O)N(O)CCC(O)=O)Cc1ccccc1