Reaction Details
TargetProlyl hydroxylase EGLN2
LigandBDBM50324531
Substrate/Competitorn/a
Meas. Tech.ChEMBL_649378 (CHEMBL1219076)
IC50>100000±n/a nM
Citation Hamada, SSuzuki, TMino, KKoseki, KOehme, FFlamme, IOzasa, HItoh, YOgasawara, DKomaarashi, HKato, ATsumoto, HNakagawa, HHasegawa, MSasaki, RMizukami, TMiyata, N Design, synthesis, enzyme-inhibitory activity, and effect on human cancer cells of a novel series of jumonji domain-containing protein 2 histone demethylase inhibitors. J Med Chem53:5629-38 (2010) 
 
Prolyl hydroxylase EGLN2
Name:Prolyl hydroxylase EGLN2
Type:Protein
Mol. Mass.:43657.01
Organism:Homo sapiens (Human)
Description:Q96KS0
Residue:407
BDBM50324531
NameBDBM50324531
Synonyms:3-(N-hydroxyacetamido)propanoic acid | CHEMBL1215449
TypeSmall organic molecule
Emp. Form.C5H9NO4
Mol. Mass.147.1293
SMILESCC(=O)N(O)CCC(O)=O