Reaction Details
TargetLysine-specific demethylase 4C
LigandBDBM50324537
Substrate/Competitorn/a
Meas. Tech.ChEMBL_649376 (CHEMBL1219074)
IC50 5200±n/a nM
Citation Hamada, SSuzuki, TMino, KKoseki, KOehme, FFlamme, IOzasa, HItoh, YOgasawara, DKomaarashi, HKato, ATsumoto, HNakagawa, HHasegawa, MSasaki, RMizukami, TMiyata, N Design, synthesis, enzyme-inhibitory activity, and effect on human cancer cells of a novel series of jumonji domain-containing protein 2 histone demethylase inhibitors. J Med Chem53:5629-38 (2010) 
 
Lysine-specific demethylase 4C
Name:Lysine-specific demethylase 4C
Type:Protein
Mol. Mass.:119979.01
Organism:Homo sapiens (Human)
Description:Q9H3R0
Residue:1056
BDBM50324537
NameBDBM50324537
Synonyms:3-{[11-(Dimethylamino)undecanoyl](hydroxy)amino}propanoicAcid Hydrochloride | CHEMBL1215521
TypeSmall organic molecule
Emp. Form.C16H32N2O4
Mol. Mass.316.4363
SMILESCN(C)CCCCCCCCCCC(=O)N(O)CCC(O)=O