Reaction Details
Target5-hydroxytryptamine receptor 2A
LigandBDBM50324567
Substrate/Competitorn/a
Meas. Tech.ChEMBL_649396 (CHEMBL1219094)
Ki 2.6±n/a nM
Citation Xiong, YUllman, BChoi, JSCherrier, MStrah-Pleynet, SDecaire, MDosa, PIFeichtinger, KTeegarden, BRFrazer, JMYoon, WHShan, YWhelan, KHauser, EKGrottick, AJSemple, GAl-Shamma, H Synthesis and in vivo evaluation of phenethylpiperazine amides: selective 5-hydroxytryptamine(2A) receptor antagonists for the treatment of insomnia. J Med Chem53:5696-706 (2010) 
 
5-hydroxytryptamine receptor 2A
Name:5-hydroxytryptamine receptor 2A
Type:undefined
Mol. Mass.:52607.65
Organism:Homo sapiens (Human)
Description:P28223
Residue:471
BDBM50324567
NameBDBM50324567
Synonyms:2-[4-(4-Chloro-1-ethyl-1H-pyrazole-3-carbonyl)piperazin-1-yl]-1-(4-fluorophenyl)ethanone | CHEMBL1214947
TypeSmall organic molecule
Emp. Form.C18H20ClFN4O2
Mol. Mass.378.828
SMILESCCn1cc(Cl)c(n1)C(=O)N1CCN(CC(=O)c2ccc(F)cc2)CC1