Reaction Details
TargetRho-associated protein kinase 2
LigandBDBM50324604
Substrate/Competitorn/a
Meas. Tech.ChEMBL_649463 (CHEMBL1219161)
IC50 2±n/a nM
Citation Fang, XYin, YChen, YTYao, LWang, BCameron, MDLin, LKhan, SRuiz, CSchröter, TGrant, WWeiser, APocas, JPachori, ASchürer, SLograsso, PFeng, Y Tetrahydroisoquinoline derivatives as highly selective and potent Rho kinase inhibitors. J Med Chem53:5727-37 (2010) 
 
Rho-associated protein kinase 2
Name:Rho-associated protein kinase 2
Type:Protein
Mol. Mass.:160885.43
Organism:Homo sapiens (Human)
Description:O75116
Residue:1388
BDBM50324604
NameBDBM50324604
Synonyms:CHEMBL1215021 | N-(4-(1H-Pyrazol-4-yl)phenyl)-2-amino-3-(3-chlorophenyl)-propanamide
TypeSmall organic molecule
Emp. Form.C18H17ClN4O
Mol. Mass.340.807
SMILESNC(Cc1ccc(Cl)cc1)C(=O)Nc1ccc(cc1)-c1cn[nH]c1