Reaction Details
TargetRho-associated protein kinase 2
LigandBDBM50324576
Substrate/Competitorn/a
Meas. Tech.ChEMBL_649463 (CHEMBL1219161)
IC50 42±n/a nM
Citation Fang, XYin, YChen, YTYao, LWang, BCameron, MDLin, LKhan, SRuiz, CSchröter, TGrant, WWeiser, APocas, JPachori, ASchürer, SLograsso, PFeng, Y Tetrahydroisoquinoline derivatives as highly selective and potent Rho kinase inhibitors. J Med Chem53:5727-37 (2010) 
 
Rho-associated protein kinase 2
Name:Rho-associated protein kinase 2
Type:Protein
Mol. Mass.:160885.43
Organism:Homo sapiens (Human)
Description:O75116
Residue:1388
BDBM50324576
NameBDBM50324576
Synonyms:(R)-N-(2-(2-Hydroxyethoxy)-4-(1H-pyrazol-4-yl)phenyl)-6-methoxy-1,2,3,4-tetrahydroisoquino-line-3-carboxamide | CHEMBL1215378
TypeSmall organic molecule
Emp. Form.C22H24N4O4
Mol. Mass.408.4504
SMILESCOc1ccc2CN[C@H](Cc2c1)C(=O)Nc1ccc(cc1OCCO)-c1cn[nH]c1