Reaction Details
TargetRho-associated protein kinase 2
LigandBDBM50324599
Substrate/Competitorn/a
Meas. Tech.ChEMBL_649463 (CHEMBL1219161)
IC50 6±n/a nM
Citation Fang, XYin, YChen, YTYao, LWang, BCameron, MDLin, LKhan, SRuiz, CSchröter, TGrant, WWeiser, APocas, JPachori, ASchürer, SLograsso, PFeng, Y Tetrahydroisoquinoline derivatives as highly selective and potent Rho kinase inhibitors. J Med Chem53:5727-37 (2010) 
 
Rho-associated protein kinase 2
Name:Rho-associated protein kinase 2
Type:Protein
Mol. Mass.:160885.43
Organism:Homo sapiens (Human)
Description:O75116
Residue:1388
BDBM50324599
NameBDBM50324599
Synonyms:(R)-N-(4-(1H-Pyrazol-4-yl)-2-(2-(pyrrolidin-1-yl)ethoxy)phenyl)-6-methoxy-1,2,3,4-tetrahydro-isoquinoline-3-carboxamide | CHEMBL1215305
TypeSmall organic molecule
Emp. Form.C26H31N5O3
Mol. Mass.461.556
SMILESCOc1ccc2CN[C@H](Cc2c1)C(=O)Nc1ccc(cc1OCCN1CCCC1)-c1cn[nH]c1