Reaction Details
TargetRho-associated protein kinase 2
LigandBDBM50324602
Substrate/Competitorn/a
Meas. Tech.ChEMBL_649463 (CHEMBL1219161)
IC50 3±n/a nM
Citation Fang, XYin, YChen, YTYao, LWang, BCameron, MDLin, LKhan, SRuiz, CSchröter, TGrant, WWeiser, APocas, JPachori, ASchürer, SLograsso, PFeng, Y Tetrahydroisoquinoline derivatives as highly selective and potent Rho kinase inhibitors. J Med Chem53:5727-37 (2010) 
 
Rho-associated protein kinase 2
Name:Rho-associated protein kinase 2
Type:Protein
Mol. Mass.:160885.43
Organism:Homo sapiens (Human)
Description:O75116
Residue:1388
BDBM50324602
NameBDBM50324602
Synonyms:(R)-6-Methoxy-N-(2-(1-methylpiperidin-4-yloxy)-4-(1H-pyrazol-4-yl)phenyl)-1,2,3,4-tetrahydro-isoquinoline-3-carboxamide | CHEMBL1215306
TypeSmall organic molecule
Emp. Form.C26H31N5O3
Mol. Mass.461.556
SMILESCOc1ccc2CN[C@H](Cc2c1)C(=O)Nc1ccc(cc1OC1CCN(C)CC1)-c1cn[nH]c1