Reaction Details
TargetRho-associated protein kinase 2
LigandBDBM50324587
Substrate/Competitorn/a
Meas. Tech.ChEMBL_649466 (CHEMBL1219164)
IC50 85±n/a nM
Citation Fang, XYin, YChen, YTYao, LWang, BCameron, MDLin, LKhan, SRuiz, CSchröter, TGrant, WWeiser, APocas, JPachori, ASchürer, SLograsso, PFeng, Y Tetrahydroisoquinoline derivatives as highly selective and potent Rho kinase inhibitors. J Med Chem53:5727-37 (2010) 
 
Rho-associated protein kinase 2
Name:Rho-associated protein kinase 2
Type:Protein
Mol. Mass.:160885.43
Organism:Homo sapiens (Human)
Description:O75116
Residue:1388
BDBM50324587
NameBDBM50324587
Synonyms:(S)-N-(2-(2-(Dimethylamino)ethoxy)-4-(1H-pyrazol-4-yl)-phenyl)-6-chloro-1,2,3,4-tetrahydroiso-quinoline-3-carboxamide | CHEMBL1215170
TypeSmall organic molecule
Emp. Form.C23H26ClN5O2
Mol. Mass.439.938
SMILESCN(C)CCOc1cc(ccc1NC(=O)[C@@H]1Cc2cc(Cl)ccc2CN1)-c1cn[nH]c1