Reaction Details
TargetRho-associated protein kinase 2
LigandBDBM50324592
Substrate/Competitorn/a
Meas. Tech.ChEMBL_649463 (CHEMBL1219161)
IC50 2±n/a nM
Citation Fang, XYin, YChen, YTYao, LWang, BCameron, MDLin, LKhan, SRuiz, CSchröter, TGrant, WWeiser, APocas, JPachori, ASchürer, SLograsso, PFeng, Y Tetrahydroisoquinoline derivatives as highly selective and potent Rho kinase inhibitors. J Med Chem53:5727-37 (2010) 
 
Rho-associated protein kinase 2
Name:Rho-associated protein kinase 2
Type:Protein
Mol. Mass.:160885.43
Organism:Homo sapiens (Human)
Description:O75116
Residue:1388
BDBM50324592
NameBDBM50324592
Synonyms:(R)-N-(2-(2-(Dimethylamino)ethoxy)-5-fluoro-4-(1H-pyrazol-4-yl)phenyl)-2-ethyl-1,2,3,4-tetra-hydroisoquinoline-3-carboxamide | CHEMBL1215526
TypeSmall organic molecule
Emp. Form.C25H30FN5O2
Mol. Mass.451.5364
SMILESCCN1Cc2ccccc2C[C@@H]1C(=O)Nc1cc(F)c(cc1OCCN(C)C)-c1cn[nH]c1